发表回复 
 
主题评价:
  • 0 次(票) - 平均星级: 0
  • 1
  • 2
  • 3
  • 4
  • 5
deepin15.5安装失败,有没有高手指点一下
2018年06月17日, 20:16
deepin15.5安装失败,有没有高手指点一下
正在读取软件包列表... 完成
正在分析软件包的依赖关系树
正在读取状态信息... 完成
g++ 已经是最新版 (4:7.2.0-1d1)。
gcc 已经是最新版 (4:7.2.0-1d1)。
升级了 0 个软件包,新安装了 0 个软件包,要卸载 0 个软件包,有 0 个软件包未被升级。
**********************************************

bufferevent_openssl.c: In function 'bio_bufferevent_new':
bufferevent_openssl.c:106:3: error: dereferencing pointer to incomplete type 'BIO {aka struct bio_st}'
b->init = 0;
^~
bufferevent_openssl.c: At top level:
bufferevent_openssl.c:228:1: error: variable 'methods_bufferevent' has initializer but incomplete type
static BIO_METHOD methods_bufferevent = {
^~~~~~
bufferevent_openssl.c:79:27: warning: excess elements in struct initializer
#define BIO_TYPE_LIBEVENT 57
^
bufferevent_openssl.c:229:2: note: in expansion of macro 'BIO_TYPE_LIBEVENT'
BIO_TYPE_LIBEVENT, "bufferevent",
^~~~~~~~~~~~~~~~~
bufferevent_openssl.c:79:27: note: (near initialization for 'methods_bufferevent')
#define BIO_TYPE_LIBEVENT 57
^
bufferevent_openssl.c:229:2: note: in expansion of macro 'BIO_TYPE_LIBEVENT'
BIO_TYPE_LIBEVENT, "bufferevent",
^~~~~~~~~~~~~~~~~
bufferevent_openssl.c:229:21: warning: excess elements in struct initializer
BIO_TYPE_LIBEVENT, "bufferevent",
^~~~~~~~~~~~~
bufferevent_openssl.c:229:21: note: (near initialization for 'methods_bufferevent')
bufferevent_openssl.c:230:2: warning: excess elements in struct initializer
bio_bufferevent_write,
^~~~~~~~~~~~~~~~~~~~~
bufferevent_openssl.c:230:2: note: (near initialization for 'methods_bufferevent')
bufferevent_openssl.c:231:2: warning: excess elements in struct initializer
bio_bufferevent_read,
^~~~~~~~~~~~~~~~~~~~
bufferevent_openssl.c:231:2: note: (near initialization for 'methods_bufferevent')
bufferevent_openssl.c:232:2: warning: excess elements in struct initializer
bio_bufferevent_puts,
^~~~~~~~~~~~~~~~~~~~
bufferevent_openssl.c:232:2: note: (near initialization for 'methods_bufferevent')
bufferevent_openssl.c:233:2: warning: excess elements in struct initializer
NULL /* bio_bufferevent_gets */,
^~~~
bufferevent_openssl.c:233:2: note: (near initialization for 'methods_bufferevent')
bufferevent_openssl.c:234:2: warning: excess elements in struct initializer
bio_bufferevent_ctrl,
^~~~~~~~~~~~~~~~~~~~
bufferevent_openssl.c:234:2: note: (near initialization for 'methods_bufferevent')
bufferevent_openssl.c:235:2: warning: excess elements in struct initializer
bio_bufferevent_new,
^~~~~~~~~~~~~~~~~~~
bufferevent_openssl.c:235:2: note: (near initialization for 'methods_bufferevent')
bufferevent_openssl.c:236:2: warning: excess elements in struct initializer
bio_bufferevent_free,
^~~~~~~~~~~~~~~~~~~~
bufferevent_openssl.c:236:2: note: (near initialization for 'methods_bufferevent')
bufferevent_openssl.c:237:2: warning: excess elements in struct initializer
NULL /* callback_ctrl */,
^~~~
bufferevent_openssl.c:237:2: note: (near initialization for 'methods_bufferevent')
bufferevent_openssl.c:228:19: error: storage size of 'methods_bufferevent' isn't known
static BIO_METHOD methods_bufferevent = {
^~~~~~~~~~~~~~~~~~~
Makefile:793: recipe for target 'bufferevent_openssl.lo' failed
make[2]: *** [bufferevent_openssl.lo] Error 1
make[2]: Leaving directory '/home/www/Downloads/server/xunsearch-full-1.4.11/libevent-2.0.21-stable'
Makefile:857: recipe for target 'install-recursive' failed
make[1]: *** [install-recursive] Error 1
make[1]: Leaving directory '/home/www/Downloads/server/xunsearch-full-1.4.11/libevent-2.0.21-stable'
Makefile:1182: recipe for target 'install' failed
make: *** [install] Error 2
***********************************************************


gcc和g++都安装了,我又重新编译安装的openssl也不行。特此请教!
查找这个用户的全部帖子
引用并回复
2018年08月22日, 09:25
RE: deepin15.5安装失败,有没有高手指点一下
建议使用官方推荐的docker安装吧,而且装好就是最新版。很方便快捷。不需要折腾依赖包什么的。
[url]https://github.com/hightman/xunsearch/blob/master/README.install[/url]
查找这个用户的全部帖子
引用并回复
发表回复 


论坛跳转:


正在浏览该主题的用户: 1 个游客