发表回复 
 
主题评价:
  • 0 次(票) - 平均星级: 0
  • 1
  • 2
  • 3
  • 4
  • 5
macbook-安装报错
2016年08月15日, 17:43 (这个帖子最后修改于: 2016年08月15日 17:46 by shy_woxian.)
心 macbook-安装报错
本人用的是macbook,是最新的系统;想在电脑上安装讯搜服务,但是每次到这都安装不过去,尝试了很多办法都不行,希望高手指点。

还有就是 如果已经安装了libevent,还需要继续安装libevent么?

libtool: link: ( cd ".libs" && rm -f "libevent_pthreads.la" && ln -s "../libevent_pthreads.la" "libevent_pthreads.la" )
/bin/sh ./libtool --tag=CC --mode=compile gcc -DHAVE_CONFIG_H -I. -I./compat -I./include -I./include -O2 -Wall -fno-strict-aliasing -Wno-deprecated-declarations -D_THREAD_SAFE -MT bufferevent_openssl.lo -MD -MP -MF .deps/bufferevent_openssl.Tpo -c -o bufferevent_openssl.lo bufferevent_openssl.c
libtool: compile: gcc -DHAVE_CONFIG_H -I. -I./compat -I./include -I./include -O2 -Wall -fno-strict-aliasing -Wno-deprecated-declarations -D_THREAD_SAFE -MT bufferevent_openssl.lo -MD -MP -MF .deps/bufferevent_openssl.Tpo -c bufferevent_openssl.c -fno-common -DPIC -o .libs/bufferevent_openssl.o
bufferevent_openssl.c:60:10: fatal error: 'openssl/bio.h' file not found
#include <openssl/bio.h>
^
1 error generated.
make[2]: *** [bufferevent_openssl.lo] Error 1
make[1]: *** [install-recursive] Error 1
make: *** [install] Error 2
-----
ERROR: failed to compile libevent, see 'setup.log' for more detail
查找这个用户的全部帖子
引用并回复
2016年09月08日, 09:36
RE: macbook-安装报错
楼主,我也是上述问题,小白,不知道怎么解决啊
查找这个用户的全部帖子
引用并回复
2016年09月19日, 10:43
RE: macbook-安装报错
两位,问题解决了吗?我也遇到这个问题了。
查找这个用户的全部帖子
引用并回复
发表回复 


论坛跳转:


正在浏览该主题的用户: 1 个游客